{"text_format":"1","workbook":"xlsx","n_sheets":4,"sheets":["INCENTIVO","COMUNI ITALIANI","U.E.","Quf"],"not_rendered":{"charts":0,"images":4,"macros":1,"external_links":0,"defined_names":2,"comments":0,"pivot_tables":0},"unopened":[],"bounds":{"document_bytes":16777216,"sheet_cells":100000,"rows_first":2000,"rows_last":500,"rows_between":2000,"halvings":0,"cell_chars":16384,"cell_head_chars":4096},"cells_cut":0,"cells_raw":0,"read":"whole","date_system":"1900"}

{"sheet":"INCENTIVO","index":0,"n_rows":54,"n_cols":11,"rows_kept":54,"cut":false,"hidden":false,"merged":[[0,0,4,4],[8,7,9,7],[8,6,9,6],[8,5,9,5],[8,4,9,4],[8,3,9,3],[8,0,9,1],[8,2,9,2],[6,1,6,9],[17,0,18,8],[17,9,18,9],[19,0,20,9],[53,0,53,9],[8,8,9,9],[21,0,22,9],[14,0,14,8],[15,9,16,9],[15,0,16,8],[10,0,10,1],[11,0,11,8],[12,0,12,8],[13,0,13,8],[10,8,10,9],[11,10,11,16],[0,10,1,16],[3,10,3,16],[5,10,5,16],[7,10,7,16],[9,10,9,16]]}
["Sede: Via G.Galilei 40 - 20092 Cinisello Balsamo, MI                                                                                          Tel. +39 02 91572030 - fax +39 02 91572008 ",null,null,null,null,null,null,null,null,"V.5.25","Istruzioni per l'inserimento dei codici dell'U.E."]
[]
[]
[null,null,null,null,null,null,null,null,null,null,"caso 1. MONOSPLIT codice unità interna/codice unità esterna es ASHG07LMCA/AOHG07LMCA"]
[]
[null,null,null,null,null,null,null,null,null,null,"caso 2. MULTISPLIT codice unità esterna(combinazione) es. AOHG24LAT3(7+7+7)"]
["RIF. Progetto:"]
[null,null,null,null,null,null,null,null,null,null,"caso 3. SIMULTANEO codice unità esterna(combinazione) es. AOHG54KRTA(24+24)"]
["U.E.",null,"COMUNE","Pn (kW) ","zona climatica","Quf","COP","Ci(=0,12 se Pn≤35kW; =0,045 se Pn>35kW; =0,06 split/multisplit)","Ia tot(*)"]
[null,null,null,null,null,null,null,null,null,null,"caso 3. VRF-MINIVRF codice unità esterna es AJH072LELAH"]
[null,null,null,{"$f":"IF(ISBLANK(A11),\"\",VLOOKUP(A11,'U.E.'!$A$2:$C$1254,2,FALSE))","v":""},{"$f":"IF(ISBLANK(C11),\"\",VLOOKUP(C11,'COMUNI ITALIANI'!$A$3:$B$8061,2,FALSE))","v":""},{"$f":"IF(ISBLANK(C11),\"\",VLOOKUP(E11,Quf!$A$2:$B$7,2,FALSE))","v":""},{"$f":"IF(ISBLANK(A11),\"\",VLOOKUP(A11,'U.E.'!$A$2:$C$1254,3,FALSE))","v":""},{"$f":"IF(ISBLANK(A11),\"\",VLOOKUP(A11,'U.E.'!$A$2:$D$1254,4,FALSE))","v":""},{"$f":"IF(ISBLANK(C11),\"\",(D11*F11)*(1-1/G11)*H11)","v":""}]
["Tipologia ",null,null,null,null,null,null,null,null,"PDC inverter","caso 3. WATERSTAGE codice unità interna/codice unità esterna es  WGHA080ML3/WOHA080KLT"]
["Spesa sostenuta"]
["corrispondente del 65% della spesa",null,null,null,null,null,null,null,null,{"$f":"(J13*65)/100","v":0}]
["Incentivo annuo calcolato",null,null,null,null,null,null,null,null,{"$f":"IF(I11=0,\"\",I11)","v":""}]
["Incentivo massimo erogabile dal GSE in 2 RATE ANNUALI (**)",null,null,null,null,null,null,null,null,{"$f":"IF(D11>35,\"0,00\",J15*2)","v":"0,00"}]
[]
[" Incentivo massimo erogabile dal GSE in 5 RATE ANNUALI(**)",null,null,null,null,null,null,null,null,{"$f":"IF(D11<35,\"0,00\",J15*5)","v":{"$error":"#VALUE!"}}]
[]
["Se l'incentivo totale nelle \"2 RATE ANNUALI\" è < di € 5.000,00, viene erogato in un'unica rata(***)."]
[]
["L'incentivo massimo calcolato NON deve superare il 65% della spesa totale sostenuta (fornitura, installazione, rimozione vecchio impianto, opere murarie, spese tecniche, iva se fa costo)."]
[]
[]
[null,"(*)art. 2 dell'ALLEGATO II del D.M. 16 Febbraio 2016",null,null,null,null,null,"(**) art. 7 del D.M. 16 Febbraio 2016"]
[]
[]
[]
[]
[]
[]
[]
[]
[]
[]
[]
[]
[]
[]
[]
[]
[]
[]
[]
[]
[null,"(***)art. 7 dell'ALLEGATO II del D.M. 16 Febbraio 2016"]
[]
[]
[]
[]
[]
[]
[]
["Il presente foglio di calcolo ha il fine di suggerire indicativamente l'incentivo erogabile dal GSE nei tempi e nelle modalità stabilite dallo stesso e la società Fujitsu General Commercial Air Conditioning Italia S.p.A. è esonerata da qualsiasi responsabilità."]

{"sheet":"COMUNI ITALIANI","index":1,"n_rows":8147,"n_cols":6,"rows_kept":8147,"cut":false,"hidden":true,"merged":[[0,0,1,0],[0,1,1,1]]}
["PROVINCIA","Zona climatica(secondo la UNI 10379)"]
[]
["AGRIGENTO","B"]
["ALESSANDRIA DELLA ROCCA","C"]
["ARAGONA","C"]
["BIVONA","C"]
["BURGIO","C"]
["CALAMONACI","C"]
["CALTABELLOTTA","D"]
["CAMASTRA","C"]
["CAMMARATA","D"]
["CAMPOBELLO DI LICATA","C"]
["CANICATTI'","D"]
["CASTELTERMINI","C"]
["CASTROFILIPPO","D"]
["CATTOLICA ERACLEA","B"]
["CIANCIANA","C"]
["COMITINI","C"]
["FAVARA","C"]
["GROTTE","C"]
["JOPPOLO GIANCAXIO","C"]
["LAMPEDUSA E LINOSA","A"]
["LICATA","B"]
["LUCCA SICULA","C"]
["MENFI","B"]
["MONTALLEGRO","B"]
["MONTEVAGO","C"]
["NARO","C"]
["PALMA DI MONTECHIARO","B"]
["PORTO EMPEDOCLE","A"]
["RACALMUTO","C"]
["RAFFADALI","C"]
["RAVANUSA","C"]
["REALMONTE","B"]
["RIBERA","C"]
["SAMBUCA DI SICILIA","C"]
["SAN BIAGIO PLATANI","C"]
["SAN GIOVANNI GEMINI","D"]
["SANT'ANGELO MUXARO","C"]
["SANTA ELISABETTA","C"]
["SANTA MARGHERITA DI STAFFORA","C"]
["SANTO STAFANO QUISQUINA","D"]
["SCIACCA","B"]
["SICULIANA","B"]
["VILLAFRANCA SICULA","C"]
["ALESSANDRIA","E"]
["AQUI TERME","E"]
["ALBERA LIGURE","E"]
["ALFIANO NATTA","E"]
["ALICE BEL COLLE","E"]
["ALLUVIONI CAMBIO'","E"]
["ALTAVILLA MONFERRATO","E"]
["ALZANO SCRIVIA","E"]
["ARQUATA SCRIVIA","E"]
["AVOLASCA","E"]
["BALZOLA","E"]
["BASALUZZO","E"]
["BASSIGNANA","E"]
["BELFORTE MONFERRATO","E"]
["BERGAMASCO","E"]
["BERZANO DI TORTONA","E"]
["BISTAGNO","E"]
["BORGHETTO DI BORBERA","E"]
["BORGO SAN MARTINO","E"]
["BORGORATTO ALESSANDRINO","E"]
["BOSCO MARENGO","E"]
["BOSIO","E"]
["BOZZOLE","E"]
["BRIGNANO FRASCATA","E"]
["CABELLA LIGURE","E"]
["CAMAGNA MONFERRATO","E"]
["CAMINO","E"]
["CANTALUPO LIGURE","E"]
["CAPRIATA D'ORBA","E"]
["CARBONARA SCRIVIA","E"]
["CARENTINO","E"]
["CAREZZANO","E"]
["CARPENETO","E"]
["CARREGA LIGURE","F"]
["CARROSIO","E"]
["CARTOSIO","E"]
["CASAL CERMELLI","E"]
["CASALE MONFERRATO","E"]
["CASALEGGIO BOIRO","E"]
["CASALNOCETO","E"]
["CASASCO","E"]
["CASSANO SPINOLA","E"]
["CASSINE","E"]
["CASSINELLE","E"]
["CASTELLANIA","E"]
["CASTELLAR GUIDOBONO","E"]
["CASTELLAZZO BORMIDA","E"]
["CASTELLETTO D'ERRO","E"]
["CASTELLETTO D'ORBA","E"]
["CASTELLETTO MERLI","E"]
["CASTELLETTO MONFERRATO","E"]
["CASTELNUOVO BORMIDA","E"]
["CASTELNUOVO SCRIVIA","E"]
["CASTELSPINA","E"]
["CAVATORE","E"]
["CELLA MONTE","E"]
["CERESETO","E"]
["CERRETO GRUE","E"]
["CERRINA MONFERRATO","E"]
["CONIOLO","E"]
["CONZANO","E"]
["COSTA VESCOVATO","E"]
["CREMOLINO","E"]
["CUCCARO MONFERRATO","E"]
["DENICE","E"]
["DERNICE","E"]
["FABBRICA CURONE","F"]
["FELIZZANO","E"]
["FRACONALTO","F"]
["FRANCAVILLA BISIO","E"]
["FRASCARO","E"]
["FRASSINELLO MONFERRATO","E"]
["FRASSINETO PO","E"]
["FRESONARA","E"]
["FRUGAROLO","E"]
["FUBINE","E"]
["GABIANO","E"]
["GAMALERO","E"]
["GARBAGNA","E"]
["GAVAZZANA","E"]
["GAVI","E"]
["GIAROLE","E"]
["GREMIASCO","E"]
["GROGNARDO","E"]
["GRONDONA","E"]
["GUAZZORA","E"]
["ISOLA SANT'ANTONIO","E"]
["LERMA","E"]
["LU","E"]
["MALVICINO","E"]
["MASIO","E"]
["MELAZZO","E"]
["MERANA","E"]
["MIRABELLO MONFERRATO","E"]
["MOLARE","E"]
["MOLINO DEI TORTI","E"]
["MOMBELLO MONFERRATO","E"]
["MOMPERONE","E"]
["MONCESTINO","E"]
["MONGIARDINO LIGURE","E"]
["MONLEALE","E"]
["MONTACUTO","E"]
["MONTALDEO","E"]
["MONTALDO BORMIDA","E"]
["MONTECASTELLO","E"]
["MONTECHIARO D'AQUI","E"]
["MONTEGIOCO","E"]
["MONTEMARZINO","E"]
["MORANO SUL PO","E"]
["MORBELLO","E"]
["MORNESE","E"]
["MORSASCO","E"]
["MURISENGO","E"]
["NOVI LIGURE","E"]
["OCCIMIANO","E"]
["ODALENGO GRANDE","E"]
["ODALENGO PICCOLO","E"]
["OLIVOLA","E"]
["ORSARA BORMIDA","E"]
["OTTIGLIO","E"]
["OVADA","E"]
["OVIGLIO","E"]
["OZZANO MONFERRATO","E"]
["PADERNA","E"]
["PARETO","E"]
["PARODI LIGURE","E"]
["PASTURANA","E"]
["PECETTO DI VALENZA","E"]
["PIETRA MARAZZI","E"]
["PIOVERA","E"]
["POMARO MONFERRATO","E"]
["PONTECURONE","E"]
["PONTESTURA","E"]
["PONTI","E"]
["PONZANO MONFERRATO","E"]
["PONZONE","F"]
["POZZOL GROPPO","E"]
["POZZOLO FORMIGARO","E"]
["PRASCO","E"]
["PREDOSA","E"]
["QUARGNENTO","E"]
["QUATTORDIO","E"]
["RICALDONE","E"]
["RIVALTA BORMIDA","E"]
["RIVARONE","E"]
["ROCCA GRIMALDA","E"]
["ROCCAFORTE LIGURE","F"]
["ROCCHETTA LIGURE","E"]
["ROSIGNANO MONFERRATO","E"]
["SALA MONFERRATO","E"]
["SALE","E"]
["SAN CRISTOFORO","E"]
["SAN GIORGIO MONFERRATO","E"]
["SAN SALVATORE MONFERRATO","E"]
["SAN SEBASTIANO CURONE","E"]
{"$rows_left_out":7948}
{"sheet":"U.E.","index":2,"n_rows":1254,"n_cols":4,"rows_kept":1254,"cut":false,"hidden":true,"merged":[]}
["TIPOLOGIA","Pn (kW) ","COP","Ci"]
["AJHA72LALH",25,4.37,0.12]
["AJHA90LALH",31.5,4.0199999999999996,0.12]
["AJH108LALH",37.5,4.04,4.4999999999999998E-2]
["AJH126LALH",45,3.93,4.4999999999999998E-2]
["AJH144LALH",50,3.97,4.4999999999999998E-2]
["AJH162LALH",56.5,4.17,4.4999999999999998E-2]
["AJH180LALH",62.5,4.17,4.4999999999999998E-2]
["AJH198LALH",69,4.03,4.4999999999999998E-2]
["AJH216LALH",75,4.04,4.4999999999999998E-2]
["AJH234LALH",82.5,3.98,4.4999999999999998E-2]
["AJH252LALH",87.5,4,4.4999999999999998E-2]
["AJH270LALH",95,3.95,4.4999999999999998E-2]
["AJH288LALH",100,3.97,4.4999999999999998E-2]
["AJH306LALH",106.5,4.04,4.4999999999999998E-2]
["AJH324LALH",112.5,4.04,4.4999999999999998E-2]
["AJH342LALH",120,4,4.4999999999999998E-2]
["AJH360LALH",125,4.01,4.4999999999999998E-2]
["AJH378LALH",132.5,3.98,4.4999999999999998E-2]
["AJH396LALH",137.5,3.99,4.4999999999999998E-2]
["AJH414LALH",145,3.96,4.4999999999999998E-2]
["AJH432LALH",150,3.97,4.4999999999999998E-2]
["AJH144LALHH",50,4.37,4.4999999999999998E-2]
["AJH198LALHH",70,4.08,4.4999999999999998E-2]
["AJH216LALHH",75,4.37,4.4999999999999998E-2]
["AJH234LALHH",81.5,4.2300000000000004,4.4999999999999998E-2]
["AJH252LALHH",87.5,4.22,4.4999999999999998E-2]
["AJH270LALHH",95,4.1500000000000004,4.4999999999999998E-2]
["AJH288LALHH",100,4.12,4.4999999999999998E-2]
["AJH306LALHH",107.5,4.0599999999999996,4.4999999999999998E-2]
["AJH324LALHH",115,4.0199999999999996,4.4999999999999998E-2]
["AJH360LALHH",127.5,3.96,4.4999999999999998E-2]
["AJH378LALHH",135,3.93,4.4999999999999998E-2]
["AJH396LALHH",140,3.94,4.4999999999999998E-2]
["AJHA72GALH",25,4.3899999999999997,0.12]
["AJHA90GALH",31.5,4.3,0.12]
["AJH108GALH",37.5,3.9,4.4999999999999998E-2]
["AJH126GALH",45,4.13,4.4999999999999998E-2]
["AJH144GALH",50,3.92,4.4999999999999998E-2]
["AJH162GALH",56.5,4.34,4.4999999999999998E-2]
["AJH180GALH",63,4.3,4.4999999999999998E-2]
["AJH198GALH",69,4.07,4.4999999999999998E-2]
["AJH216GALH",75,3.9,4.4999999999999998E-2]
["AJH234GALH",81.5,4.05,4.4999999999999998E-2]
["AJH252GALH",87.5,3.91,4.4999999999999998E-2]
["AJH270GALH",95,4.01,4.4999999999999998E-2]
["AJH288GALH",100,3.92,4.4999999999999998E-2]
["AJH306GALH",106.5,4.01,4.4999999999999998E-2]
["AJH324GALH",112.5,3.9,4.4999999999999998E-2]
["AJH342GALH",119,4,4.4999999999999998E-2]
["AJH360GALH",125,3.91,4.4999999999999998E-2]
["AJH378GALH",131.5,4,4.4999999999999998E-2]
["AJH396GALH",137.5,3.91,4.4999999999999998E-2]
["AJH414GALH",145,3.98,4.4999999999999998E-2]
["AJH432GALH",150,3.92,4.4999999999999998E-2]
["AJH144GALHH",50,4.3899999999999997,4.4999999999999998E-2]
["AJH198GALHH",70,4.22,4.4999999999999998E-2]
["AJH216GALHH",75,4.3899999999999997,4.4999999999999998E-2]
["AJH234GALHH",81.5,4.3499999999999996,4.4999999999999998E-2]
["AJH252GALHH",88,4.32,4.4999999999999998E-2]
["AJH270GALHH",88,4.32,4.4999999999999998E-2]
["AJH288GALHH",101.5,4.24,4.4999999999999998E-2]
["AJH306GALHH",101.5,4.24,4.4999999999999998E-2]
["AJH324GALHH",115,4.18,4.4999999999999998E-2]
["AJH342GALHH",121.5,4.17,4.4999999999999998E-2]
["AJH360GALHH",126.5,4.08,4.4999999999999998E-2]
["AJH378GALHH",135,4.13,4.4999999999999998E-2]
["AJH396GALHH",140,4.05,4.4999999999999998E-2]
["AJH072LALBH",25,4.84,0.12]
["AJH090LALBH",31.5,4.3499999999999996,0.12]
["AJH108LALBH",37.5,4.34,4.4999999999999998E-2]
["AJH126LALBH",45,4.03,4.4999999999999998E-2]
["AJH180LALBH",63,4.34,4.4999999999999998E-2]
["AJH198LALBH",70,4.28,4.4999999999999998E-2]
["AJH216LALBH",76.5,4.1500000000000004,4.4999999999999998E-2]
["AJH234LALBH",81.5,3.9,4.4999999999999998E-2]
["AJH252LALBH",81.5,3.9,4.4999999999999998E-2]
["AJH270LALBH",95,3.83,4.4999999999999998E-2]
["AJH342LALBH",113,4.0199999999999996,4.4999999999999998E-2]
["AJH360LALBH",126.5,3.95,4.4999999999999998E-2]
["AJH378LALBH",131.5,3.81,4.4999999999999998E-2]
["AJH396LALBH",131.5,3.81,4.4999999999999998E-2]
["AJH414LALBH",131.5,3.81,4.4999999999999998E-2]
["AJH144LALBHH",50,4.84,4.4999999999999998E-2]
["AJH162LALBHH",56.5,4.55,4.4999999999999998E-2]
["AJH180LALBHH",62.5,4.5199999999999996,4.4999999999999998E-2]
["AJH216LALBHH",75,4.84,4.4999999999999998E-2]
["AJH234LALBHH",81.5,4.63,4.4999999999999998E-2]
["AJH252LALBHH",87.5,4.6100000000000003,4.4999999999999998E-2]
["AJH270LALBHH",95,4.42,4.4999999999999998E-2]
["AJH288LALBHH",100,4.45,4.4999999999999998E-2]
["AJH306LALBHH",107.5,4.3,4.4999999999999998E-2]
["AJH324LALBHH",112.5,4.34,4.4999999999999998E-2]
["AJH342LALBHH",120,4.21,4.4999999999999998E-2]
["AJH360LALBHH",127.5,4.1100000000000003,4.4999999999999998E-2]
["AJH378LALBHH",135,4.03,4.4999999999999998E-2]
["AJH396LALBHH",140,3.89,4.4999999999999998E-2]
["AJH414LALBHH",145,3.77,4.4999999999999998E-2]
["AJH072LALDH",22.4,4.13,0.12]
["AJH090LALDH",28,3.76,0.12]
["AJH108LALDH",33.5,4.3099999999999996,0.12]
["AJH162LALDH",50.4,3.92,4.4999999999999998E-2]
["AJH180LALDH",56,3.76,4.4999999999999998E-2]
["AJH144LALDHH",44.8,4.13,4.4999999999999998E-2]
["AJH180LALDHH",55.9,4.24,4.4999999999999998E-2]
["AJH216LALDHH",67.2,4.13,4.4999999999999998E-2]
["AJH234LALDHH",72.8,3.98,4.4999999999999998E-2]
["AJH252LALDHH",78.3,4.21,4.4999999999999998E-2]
["AJH270LALDHH",84.8,3.76,4.4999999999999998E-2]
["AJH288LALDHH",89.4,4.2699999999999996,4.4999999999999998E-2]
["AJH306LALDHH",95.9,3.85,4.4999999999999998E-2]
["AJH324LALDHH",100.5,4.32,4.4999999999999998E-2]
["AJH342LALDHH",107,3.93,4.4999999999999998E-2]
["AJH072GALBH",22.4,4.74,0.12]
["AJH090GALBH",28,4.67,0.12]
["AJH108GALBH",33.5,4.25,0.12]
["AJH126GALBH",40,4.5199999999999996,4.4999999999999998E-2]
["AJH144GALBH",45,4.2699999999999996,4.4999999999999998E-2]
["AJH162GALBH",50.4,4.7,4.4999999999999998E-2]
["AJH180GALBH",56,4.67,4.4999999999999998E-2]
["AJH198GALBH",61.5,4.43,4.4999999999999998E-2]
["AJH216GALBH",67,4.25,4.4999999999999998E-2]
["AJH234GALBH",73,4.41,4.4999999999999998E-2]
["AJH252GALBH",78.5,4.26,4.4999999999999998E-2]
["AJH270GALBH",85,4.38,4.4999999999999998E-2]
["AJH288GALBH",90,4.2699999999999996,4.4999999999999998E-2]
["AJH306GALBH",95,4.3600000000000003,4.4999999999999998E-2]
["AJH324GALBH",100.5,4.25,4.4999999999999998E-2]
["AJH342GALBH",106.5,4.3600000000000003,4.4999999999999998E-2]
["AJH360GALBH",112,4.26,4.4999999999999998E-2]
["AJH378GALBH",118,4.3600000000000003,4.4999999999999998E-2]
["AJH396GALBH",123.5,4.26,4.4999999999999998E-2]
["AJH414GALBH",130,4.34,4.4999999999999998E-2]
["AJH432GALBH",135,4.2699999999999996,4.4999999999999998E-2]
["AJH144GALBHH",44.8,4.74,4.4999999999999998E-2]
["AJH198GALBHH",62.4,4.59,4.4999999999999998E-2]
["AJH216GALBHH",67.2,4.74,4.4999999999999998E-2]
["AJH234GALBHH",72.8,4.71,4.4999999999999998E-2]
["AJH252GALBHH",78.400000000000006,4.6900000000000004,4.4999999999999998E-2]
["AJH270GALBHH",84,4.67,4.4999999999999998E-2]
["AJH288GALBHH",90.4,4.62,4.4999999999999998E-2]
["AJH306GALBHH",96,4.5999999999999996,4.4999999999999998E-2]
["AJH324GALBHH",102.4,4.57,4.4999999999999998E-2]
["AJH342GALBHH",108,4.5599999999999996,4.4999999999999998E-2]
["AJH360GALBHH",113,4.45,4.4999999999999998E-2]
["AJH378GALBHH",120,4.5199999999999996,4.4999999999999998E-2]
["AJH396GALBHH",125,4.43,4.4999999999999998E-2]
["AJH072GALDH",22.4,4.17,0.12]
["AJH090GALDH",28,3.79,0.12]
["AJH162GALDH",50.4,3.95,4.4999999999999998E-2]
["AJH180GALDH",56,3.79,4.4999999999999998E-2]
["AJH198GALDH",61.5,3.72,4.4999999999999998E-2]
["AJH144GALDHH",44.8,4.17,4.4999999999999998E-2]
["AJH198GALDHH",62.4,3.86,4.4999999999999998E-2]
["AJH216GALDHH",67.2,4.17,4.4999999999999998E-2]
["AJH234GALDHH",72.8,4.0199999999999996,4.4999999999999998E-2]
["AJH252GALDHH",78.400000000000006,3.89,4.4999999999999998E-2]
["AJH270GALDHH",84,3.79,4.4999999999999998E-2]
["AJH288GALDHH",90.4,3.84,4.4999999999999998E-2]
["AJH306GALDHH",96,3.76,4.4999999999999998E-2]
["AJH324GALDHH",102.4,3.8,4.4999999999999998E-2]
["AJH342GALDHH",108,3.73,4.4999999999999998E-2]
["AJH040LELAH",13.6,5.01,0.12]
["AJH045LELAH",16,4.7,0.12]
["AJH054LELAH",18,4.41,0.12]
["AJH040LBLBH",12.1,5.0599999999999996,0.12]
["AJH045LBLBH",14,4.71,0.12]
["AJH054LBLBH",15.5,4.43,0.12]
["AJH040LELBH",12.1,5.21,0.12]
["AJH045LELBH",14,4.9000000000000004,0.12]
["AJH054LELBH",15.5,4.6100000000000003,0.12]
["AJH040LBLDH",12.1,3.85,0.12]
["AJH045LBLDH",14,3.88,0.12]
["AJH054LBLDH",15.5,3.71,0.12]
["AJH040LELDH",12.1,3.85,0.12]
["AJH045LELDH",14,3.88,0.12]
["AJH054LELDH",15.5,3.71,0.12]
["AJHA40LALH",13.6,4.29,0.12]
["AJHA45LALH",16,4.2,0.12]
["AJHA54LALH",18,3.95,0.12]
["AJH040LCLAH",13.6,4.4000000000000004,0.12]
["AJH045LCLAH",16,4.07,0.12]
["AJH054LCLAH",16.5,4.01,0.12]
["AJH040LCLBH",12.1,4.74,0.12]
["AJH045LCLBH",14,4.51,0.12]
["AJH054LCLBH",15.1,4.3,0.12]
["AJH040LCLDH",12.1,3.75,0.12]
["AJH045LCLDH",14,3.71,0.12]
["AJH054LCLDH",15.1,3.48,0.12]
["AJH072LELAH",22.4,4.82,0.12]
["AJH090LELAH",28,4.24,0.12]
["AJH108LELAH",33.5,4.0999999999999996,0.12]
["AJH126LELAH",40,4.12,4.4999999999999998E-2]
["AJH144LELAH",45,3.81,4.4999999999999998E-2]
["AJH072LELBH",22.4,4.82,0.12]
["AJH090LELBH",28,4.24,0.12]
["AJH108LELBH",33.5,4.0999999999999996,0.12]
["AJH126LELBH",40,4.12,4.4999999999999998E-2]
["AJH144LELBH",45,3.81,4.4999999999999998E-2]
["AJH072LELDH",22.4,4.82,0.12]
{"$rows_left_out":1055}
{"sheet":"Quf","index":3,"n_rows":7,"n_cols":2,"rows_kept":7,"cut":false,"hidden":true,"merged":[]}
["ZONA CLIMATICA","Quf"]
["A",600]
["B",850]
["C",1100]
["D",1400]
["E",1700]
["F",1800]